Reaction Details
TargetD(4) dopamine receptor
LigandBDBM50156950
Substrate/Competitorn/a
Meas. Tech.ChEMBL_1571915 (CHEMBL3796307)
IC50 56±n/a nM
Citation Witt, JOMcCollum, ALHurtado, MAHuseman, EDJeffries, DETemple, KJPlumley, HCBlobaum, ALLindsley, CWHopkins, CR Synthesis and characterization of a series of chiral alkoxymethyl morpholine analogs as dopamine receptor 4 (D4R) antagonists. Bioorg Med Chem Lett26:2481-8 (2016) 
 
D(4) dopamine receptor
Name:D(4) dopamine receptor
Type:Enzyme
Mol. Mass.:48373.19
Organism:Homo sapiens (Human)
Description:P21917
Residue:419
BDBM50156950
NameBDBM50156950
Synonyms:CHEMBL3793910
TypeSmall organic molecule
Emp. Form.C19H22FNO3
Mol. Mass.331.3813
SMILESCOc1ccc(CN2CCO[C@H](COc3ccccc3)C2)cc1F