Reaction Details
TargetD(4) dopamine receptor
LigandBDBM50156964
Substrate/Competitorn/a
Meas. Tech.ChEMBL_1571915 (CHEMBL3796307)
IC50 47±n/a nM
Citation Witt, JOMcCollum, ALHurtado, MAHuseman, EDJeffries, DETemple, KJPlumley, HCBlobaum, ALLindsley, CWHopkins, CR Synthesis and characterization of a series of chiral alkoxymethyl morpholine analogs as dopamine receptor 4 (D4R) antagonists. Bioorg Med Chem Lett26:2481-8 (2016) 
 
D(4) dopamine receptor
Name:D(4) dopamine receptor
Type:Enzyme
Mol. Mass.:48373.19
Organism:Homo sapiens (Human)
Description:P21917
Residue:419
BDBM50156964
NameBDBM50156964
Synonyms:CHEMBL3793375
TypeSmall organic molecule
Emp. Form.C19H22FNO3
Mol. Mass.331.3813
SMILESCOc1ccc(CN2CCO[C@H](COc3ccc(F)cc3)C2)cc1