Reaction Details
TargetD(4) dopamine receptor
LigandBDBM50157070
Substrate/Competitorn/a
Meas. Tech.ChEMBL_1571915 (CHEMBL3796307)
IC50 100±n/a nM
Citation Witt, JOMcCollum, ALHurtado, MAHuseman, EDJeffries, DETemple, KJPlumley, HCBlobaum, ALLindsley, CWHopkins, CR Synthesis and characterization of a series of chiral alkoxymethyl morpholine analogs as dopamine receptor 4 (D4R) antagonists. Bioorg Med Chem Lett26:2481-8 (2016) 
 
D(4) dopamine receptor
Name:D(4) dopamine receptor
Type:Enzyme
Mol. Mass.:48373.19
Organism:Homo sapiens (Human)
Description:P21917
Residue:419
BDBM50157070
NameBDBM50157070
Synonyms:CHEMBL3792725
TypeSmall organic molecule
Emp. Form.C17H18Cl2N2O2
Mol. Mass.353.243
SMILESClc1ccc(CN2CCO[C@H](COc3cccc(Cl)n3)C2)cc1