Reaction Details
TargetCarbonic anhydrase
LigandBDBM50158524
Substrate/Competitorn/a
Meas. Tech.ChEMBL_1566138 (CHEMBL3787807)
Ki 66±n/a nM
Citation Akdemir, AGüzel-Akdemir, ÖKarali, NSupuran, CT Isatin analogs as novel inhibitors of Candida spp.ß-carbonic anhydrase enzymes. Bioorg Med Chem24:1648-52 (2016) 
 
Carbonic anhydrase
Name:Carbonic anhydrase
Type:Enzyme
Mol. Mass.:31587.59
Organism:Candida albicans (Yeast)
Description:n/a
Residue:281
BDBM50158524
NameBDBM50158524
Synonyms:CHEMBL3786965
TypeSmall organic molecule
Emp. Form.C14H10ClN3O3S
Mol. Mass.335.766
SMILESNS(=O)(=O)c1ccccc1\N=C1/C(=O)Nc2ccc(Cl)cc12