Reaction Details
TargetCarbonic anhydrase
LigandBDBM50158511
Substrate/Competitorn/a
Meas. Tech.ChEMBL_1566138 (CHEMBL3787807)
Ki 76±n/a nM
Citation Akdemir, AGüzel-Akdemir, ÖKarali, NSupuran, CT Isatin analogs as novel inhibitors of Candida spp.ß-carbonic anhydrase enzymes. Bioorg Med Chem24:1648-52 (2016) 
 
Carbonic anhydrase
Name:Carbonic anhydrase
Type:Enzyme
Mol. Mass.:31587.59
Organism:Candida albicans (Yeast)
Description:n/a
Residue:281
BDBM50158511
NameBDBM50158511
Synonyms:CHEMBL3785209
TypeSmall organic molecule
Emp. Form.C15H13N3O3S
Mol. Mass.315.347
SMILESCN1C(=O)\C(=N/c2ccc(cc2)S(N)(=O)=O)c2ccccc12