Reaction Details
TargetCarbonic anhydrase
LigandBDBM50158519
Substrate/Competitorn/a
Meas. Tech.ChEMBL_1566138 (CHEMBL3787807)
Ki 54±n/a nM
Citation Akdemir, AGüzel-Akdemir, ÖKarali, NSupuran, CT Isatin analogs as novel inhibitors of Candida spp.ß-carbonic anhydrase enzymes. Bioorg Med Chem24:1648-52 (2016) 
 
Carbonic anhydrase
Name:Carbonic anhydrase
Type:Enzyme
Mol. Mass.:31587.59
Organism:Candida albicans (Yeast)
Description:n/a
Residue:281
BDBM50158519
NameBDBM50158519
Synonyms:CHEMBL3787255
TypeSmall organic molecule
Emp. Form.C15H10F3N3O4S
Mol. Mass.385.318
SMILESNS(=O)(=O)c1ccc(cc1)\N=C1/C(=O)Nc2ccc(OC(F)(F)F)cc12