Reaction Details
TargetMelanin-concentrating hormone receptor 1
LigandBDBM50159145
Substrate/Competitorn/a
Meas. Tech.ChEBML_1566576
IC50 22±n/a nM
Citation Johansson, ALöfberg, CAntonsson, Mvon Unge, SHayes, MAJudkins, RPloj, KBenthem, LLindén, DBrodin, PWennerberg, MFredenwall, MLi, LPersson, JBergman, RPettersen, AGennemark, PHogner, A Discovery of (3-(4-(2-Oxa-6-azaspiro[3.3]heptan-6-ylmethyl)phenoxy)azetidin-1-yl)(5-(4-methoxyphenyl)-1,3,4-oxadiazol-2-yl)methanone (AZD1979), a Melanin Concentrating Hormone Receptor 1 (MCHr1) Antagonist with Favorable Physicochemical Properties. J Med Chem59:2497-511 (2016) 
 
Melanin-concentrating hormone receptor 1
Name:Melanin-concentrating hormone receptor 1
Type:G Protein-Coupled Receptor (GPCR)
Mol. Mass.:45976.27
Organism:Homo sapiens (Human)
Description:Membranes from CHO-K1 cells stably expressing human MCH1R were used in assays.
Residue:422
BDBM50159145
NameBDBM50159145
Synonyms:CHEMBL3786685
TypeSmall organic molecule
Emp. Form.C24H26N4O4
Mol. Mass.434.4876
SMILESCC1(O)CCN(Cc2ccc(OC3CN(C3)C(=O)c3nnc(o3)-c3ccccc3)cc2)C1