Reaction Details
TargetMelanin-concentrating hormone receptor 1
LigandBDBM119758
Substrate/Competitorn/a
Meas. Tech.ChEMBL_1566576 (CHEMBL3791470)
IC50 20±n/a nM
Citation Johansson, ALöfberg, CAntonsson, Mvon Unge, SHayes, MAJudkins, RPloj, KBenthem, LLindén, DBrodin, PWennerberg, MFredenwall, MLi, LPersson, JBergman, RPettersen, AGennemark, PHogner, A Discovery of (3-(4-(2-Oxa-6-azaspiro[3.3]heptan-6-ylmethyl)phenoxy)azetidin-1-yl)(5-(4-methoxyphenyl)-1,3,4-oxadiazol-2-yl)methanone (AZD1979), a Melanin Concentrating Hormone Receptor 1 (MCHr1) Antagonist with Favorable Physicochemical Properties. J Med Chem59:2497-511 (2016) 
 
Melanin-concentrating hormone receptor 1
Name:Melanin-concentrating hormone receptor 1
Type:G Protein-Coupled Receptor (GPCR)
Mol. Mass.:45976.27
Organism:Homo sapiens (Human)
Description:Membranes from CHO-K1 cells stably expressing human MCH1R were used in assays.
Residue:422
BDBM119758
NameBDBM119758
Synonyms:US8685958, 7 | US8685958, 8
TypeSmall organic molecule
Emp. Form.C25H26N4O4
Mol. Mass.446.4983
SMILESO=C(N1CC(C1)Oc1ccc(CN2CC3(C2)CCOC3)cc1)c1nnc(o1)-c1ccccc1