Reaction Details
TargetMelanin-concentrating hormone receptor 1
LigandBDBM50159142
Substrate/Competitorn/a
Meas. Tech.ChEMBL_1566584 (CHEMBL3791478)
IC50 9±n/a nM
Citation Johansson, ALöfberg, CAntonsson, Mvon Unge, SHayes, MAJudkins, RPloj, KBenthem, LLindén, DBrodin, PWennerberg, MFredenwall, MLi, LPersson, JBergman, RPettersen, AGennemark, PHogner, A Discovery of (3-(4-(2-Oxa-6-azaspiro[3.3]heptan-6-ylmethyl)phenoxy)azetidin-1-yl)(5-(4-methoxyphenyl)-1,3,4-oxadiazol-2-yl)methanone (AZD1979), a Melanin Concentrating Hormone Receptor 1 (MCHr1) Antagonist with Favorable Physicochemical Properties. J Med Chem59:2497-511 (2016) 
 
Melanin-concentrating hormone receptor 1
Name:Melanin-concentrating hormone receptor 1
Type:PROTEIN
Mol. Mass.:39133.74
Organism:Mus musculus
Description:ChEMBL_818502
Residue:353
BDBM50159142
NameBDBM50159142
Synonyms:CHEMBL3786311
TypeSmall organic molecule
Emp. Form.C26H30N4O5
Mol. Mass.478.5402
SMILESCOc1ccc(cc1)-c1nnc(o1)C(=O)N1CC(C1)Oc1ccc(CN(C)CC2(C)COC2)cc1