Reaction Details
TargetMetabotropic glutamate receptor 2
LigandBDBM50034503
Substrate/Competitorn/a
Meas. Tech.ChEMBL_1568614 (CHEMBL3791047)
EC50 350±n/a nM
Citation Huynh, THErichsen, MNTora, ASGoudet, CSagot, EAssaf, ZThomsen, CBrodbeck, RStensbøl, TBBjørn-Yoshimoto, WENielsen, BPin, JPGefflaut, TBunch, L New 4-Functionalized Glutamate Analogues Are Selective Agonists at Metabotropic Glutamate Receptor Subtype 2 or Selective Agonists at Metabotropic Glutamate Receptor Group III. J Med Chem59:914-24 (2016) 
 
Metabotropic glutamate receptor 2
Name:Metabotropic glutamate receptor 2
Type:Enzyme
Mol. Mass.:95584.88
Organism:Homo sapiens (Human)
Description:Q14416
Residue:872
BDBM50034503
NameBDBM50034503
Synonyms:(1R,2R)-3-((S)-Amino-carboxy-methyl)-cyclopropane-1,2-dicarboxylic acid (2S,2'R,3'R)-2-(2',3')-dicarboxycyclopropylglycine CHEMBL284193 | DCG-IV
TypeSmall organic molecule
Emp. Form.C7H9NO6
Mol. Mass.203.1495
SMILESN[C@@H](C1[C@H]([C@@H]1C(O)=O)C(O)=O)C(O)=O