Reaction Details
TargetExcitatory amino acid transporter 1
LigandBDBM50159146
Substrate/Competitorn/a
Meas. Tech.ChEMBL_1568619 (CHEMBL3791052)
IC50>300000±n/a nM
Citation Huynh, THErichsen, MNTora, ASGoudet, CSagot, EAssaf, ZThomsen, CBrodbeck, RStensbøl, TBBjørn-Yoshimoto, WENielsen, BPin, JPGefflaut, TBunch, L New 4-Functionalized Glutamate Analogues Are Selective Agonists at Metabotropic Glutamate Receptor Subtype 2 or Selective Agonists at Metabotropic Glutamate Receptor Group III. J Med Chem59:914-24 (2016) 
 
Excitatory amino acid transporter 1
Name:Excitatory amino acid transporter 1
Type:Enzyme Catalytic Domain
Mol. Mass.:59577.19
Organism:Homo sapiens (Human)
Description:Excitatory Amino Acid EAAT1 0 HUMAN::P43003
Residue:542
BDBM50159146
NameBDBM50159146
Synonyms:CHEMBL3786938
TypeSmall organic molecule
Emp. Form.C8H11NO6
Mol. Mass.217.176
SMILES[H][C@]1(C[C@@]1(C[C@H](N)C(O)=O)C(O)=O)C(O)=O