Reaction Details
TargetExcitatory amino acid transporter 2
LigandBDBM50159150
Substrate/Competitorn/a
Meas. Tech.ChEMBL_1568621 (CHEMBL3791054)
IC50>300000±n/a nM
Citation Huynh, THErichsen, MNTora, ASGoudet, CSagot, EAssaf, ZThomsen, CBrodbeck, RStensbøl, TBBjørn-Yoshimoto, WENielsen, BPin, JPGefflaut, TBunch, L New 4-Functionalized Glutamate Analogues Are Selective Agonists at Metabotropic Glutamate Receptor Subtype 2 or Selective Agonists at Metabotropic Glutamate Receptor Group III. J Med Chem59:914-24 (2016) 
 
Excitatory amino acid transporter 2
Name:Excitatory amino acid transporter 2
Type:Enzyme Catalytic Domain
Mol. Mass.:62103.57
Organism:Homo sapiens (Human)
Description:Excitatory Amino Acid EAAT2 0 0::P43004
Residue:574
BDBM50159150
NameBDBM50159150
Synonyms:CHEMBL3787264
TypeSmall organic molecule
Emp. Form.C8H11NO6
Mol. Mass.217.176
SMILES[H][C@@]1(C[C@]1(C[C@H](N)C(O)=O)C(O)=O)C(O)=O