Reaction Details
TargetAdenosine receptor A2a
LigandBDBM21173
Substrate/Competitorn/a
Meas. Tech.ChEBML_1569184
Ki 157±n/a nM
Citation El Maatougui, AAzuaje, JGonzález-Gómez, MMiguez, GCrespo, ACarbajales, CEscalante, LGarcía-Mera, XGutiérrez-de-Terán, HSotelo, E Discovery of Potent and Highly Selective A2B Adenosine Receptor Antagonist Chemotypes. J Med Chem59:1967-83 (2016) 
 
Adenosine receptor A2a
Name:Adenosine receptor A2a
Type:G Protein-Coupled Receptor (GPCR)
Mol. Mass.:44716.46
Organism:Homo sapiens (Human)
Description:P29274
Residue:412
BDBM21173
NameBDBM21173
Synonyms:1,3-dipropyl-8-cyclopentylxanthine CHEMBL183 PD116948 | [3H]DPCPX
Typeradiolabeled ligand
Emp. Form.C16H24N4O2
Mol. Mass.304.3874
SMILESCCCn1c2nc([nH]c2c(=O)n(CCC)c1=O)C1CCCC1