Reaction Details
TargetHydroxycarboxylic acid receptor 2
LigandBDBM23515
Substrate/Competitorn/a
Meas. Tech.ChEMBL_1567255 (CHEMBL3788712)
EC50 730±n/a nM
Citation Vu, CBBemis, JEBenson, EBista, PCarney, DFahrner, RLee, DLiu, FLonkar, PMilne, JCNichols, AJPicarella, DShoelson, ASmith, JTing, AWensley, AYeager, MZimmer, MJirousek, MR Synthesis and Characterization of Fatty Acid Conjugates of Niacin and Salicylic Acid. J Med Chem59:1217-31 (2016) 
 
Hydroxycarboxylic acid receptor 2
Name:Hydroxycarboxylic acid receptor 2
Type:G Protein-Coupled Receptor (GPCR)
Mol. Mass.:41868.22
Organism:Homo sapiens (Human)
Description:Membranes from CHO cells expressing the recombinant human GPR109A were used in competition binding assay.
Residue:363
BDBM23515
NameBDBM23515
Synonyms:CHEMBL573 Nicotinic Acid pyridine-3-carboxylic acid | wampocap
TypeSmall organic molecule
Emp. Form.C6H5NO2
Mol. Mass.123.1094
SMILESOC(=O)c1cccnc1