Reaction Details
TargetSterol regulatory element-binding protein 2
LigandBDBM50159362
Substrate/Competitorn/a
Meas. Tech.ChEMBL_1567262 (CHEMBL3788940)
IC50 17000±n/a nM
Citation Vu, CBBemis, JEBenson, EBista, PCarney, DFahrner, RLee, DLiu, FLonkar, PMilne, JCNichols, AJPicarella, DShoelson, ASmith, JTing, AWensley, AYeager, MZimmer, MJirousek, MR Synthesis and Characterization of Fatty Acid Conjugates of Niacin and Salicylic Acid. J Med Chem59:1217-31 (2016) 
 
Sterol regulatory element-binding protein 2
Name:Sterol regulatory element-binding protein 2
Type:PROTEIN
Mol. Mass.:123713.87
Organism:Homo sapiens (Human)
Description:ChEMBL_765690
Residue:1141
BDBM50159362
NameBDBM50159362
Synonyms:CHEMBL3785912
TypeSmall organic molecule
Emp. Form.C28H39N3O2
Mol. Mass.449.6282
SMILESCC\C=C/C\C=C/C\C=C/C\C=C/C\C=C/CCCC(=O)NCCNC(=O)c1cccnc1