Reaction Details
TargetPhosphatidylinositol 4,5-bisphosphate 3-kinase catalytic subunit delta isoform
LigandBDBM50160074
Substrate/Competitorn/a
Meas. Tech.ChEMBL_1565823 (CHEMBL3789430)
IC50 152±n/a nM
Citation Rutaganira, FUFowler, MLMcPhail, JAGelman, MANguyen, KXiong, ADornan, GLTavshanjian, BGlenn, JSShokat, KMBurke, JE Design and Structural Characterization of Potent and Selective Inhibitors of Phosphatidylinositol 4 Kinase IIIß. J Med Chem59:1830-9 (2016) 
 
Phosphatidylinositol 4,5-bisphosphate 3-kinase catalytic subunit delta isoform
Name:Phosphatidylinositol 4,5-bisphosphate 3-kinase catalytic subunit delta isoform
Type:Enzyme Subunit
Mol. Mass.:119489.41
Organism:Homo sapiens (Human)
Description:O00329
Residue:1044
BDBM50160074
NameBDBM50160074
Synonyms:CHEMBL3785311
TypeSmall organic molecule
Emp. Form.C23H25N3O5S2
Mol. Mass.487.592
SMILESCOc1ccc(cc1S(=O)(=O)Nc1ccc(O)cc1)-c1sc(NC(=O)C2CCCC2)nc1C