Reaction Details
TargetPhosphatidylinositol 3-kinase catalytic subunit type 3
LigandBDBM50160072
Substrate/Competitorn/a
Meas. Tech.ChEMBL_1565824 (CHEMBL3789431)
IC50 245±n/a nM
Citation Rutaganira, FUFowler, MLMcPhail, JAGelman, MANguyen, KXiong, ADornan, GLTavshanjian, BGlenn, JSShokat, KMBurke, JE Design and Structural Characterization of Potent and Selective Inhibitors of Phosphatidylinositol 4 Kinase IIIß. J Med Chem59:1830-9 (2016) 
 
Phosphatidylinositol 3-kinase catalytic subunit type 3
Name:Phosphatidylinositol 3-kinase catalytic subunit type 3
Type:Enzyme
Mol. Mass.:101551.30
Organism:Homo sapiens (Human)
Description:Recombinant human Vps34 protein was expressed as monomeric GST-fusion and purified.
Residue:887
BDBM50160072
NameBDBM50160072
Synonyms:CHEMBL3787054
TypeSmall organic molecule
Emp. Form.C18H15ClFN3O3S2
Mol. Mass.439.911
SMILESCC(=O)Nc1nc(C)c(s1)-c1ccc(Cl)c(c1)S(=O)(=O)Nc1ccc(F)cc1