Reaction Details
TargetPotassium voltage-gated channel subfamily A member 5
LigandBDBM50160712
Substrate/Competitorn/a
Meas. Tech.ChEMBL_1566417 (CHEMBL3790037)
IC50 700±n/a nM
Citation Kajanus, JJacobson, IÅstrand, AOlsson, RIGran, UBjöre, AFjellström, ODavidsson, ÖEmtenäs, HDahlén, ALöfberg, BYuan, ZQSundell, JCassel, JGyll, JIliefski, THögberg, ÅLindhardt, EMalmberg, J Isoindolinone compounds active as Kv1.5 blockers identified using a multicomponent reaction approach. Bioorg Med Chem Lett26:2023-9 (2016) 
 
Potassium voltage-gated channel subfamily A member 5
Name:Potassium voltage-gated channel subfamily A member 5
Type:Enzyme
Mol. Mass.:67222.47
Organism:Homo sapiens (Human)
Description:P22460
Residue:613
BDBM50160712
NameBDBM50160712
Synonyms:CHEMBL3785768
TypeSmall organic molecule
Emp. Form.C22H24ClFN2O2
Mol. Mass.402.89
SMILESCC(C)(CN1C(C(=O)NCCCF)c2ccccc2C1=O)c1ccc(Cl)cc1