Reaction Details
TargetCarbonic anhydrase 1
LigandBDBM10866
Substrate/Competitorn/a
Meas. Tech.ChEBML_1567376
Ki 5800±n/a nM
Citation Del Prete, SVullo, DDe Luca, VCarginale, VOsman, SMAlOthman, ZSupuran, CTCapasso, C Comparison of the sulfonamide inhibition profiles of thea-,ß- and¿-carbonic anhydrases from the pathogenic bacterium Vibrio cholerae. Bioorg Med Chem Lett26:1941-6 (2016) 
 
Carbonic anhydrase 1
Name:Carbonic anhydrase 1
Type:Enzyme
Mol. Mass.:28873.37
Organism:Homo sapiens (Human)
Description:P00915
Residue:261
BDBM10866
NameBDBM10866
Synonyms:4-amino-6-(trifluoromethyl)benzene-1,3-disulfonamide aromatic/heteroaromatic sulfonamide 11
TypeSmall organic molecule
Emp. Form.C7H8F3N3O4S2
Mol. Mass.319.281
SMILESNc1cc(c(cc1S(N)(=O)=O)S(N)(=O)=O)C(F)(F)F