Reaction Details
TargetAurora kinase B
LigandBDBM50053262
Substrate/Competitorn/a
Meas. Tech.ChEMBL_1570319 (CHEMBL3795295)
IC50 5940±n/a nM
Citation Jeong, YLee, JRyu, JS Design, synthesis, and evaluation of hinge-binder tethered 1,2,3-triazolylsalicylamide derivatives as Aurora kinase inhibitors. Bioorg Med Chem24:2114-24 (2016) 
 
Aurora kinase B
Name:Aurora kinase B
Type:Protein
Mol. Mass.:39327.72
Organism:Homo sapiens (Human)
Description:Q96GD4
Residue:344
BDBM50053262
NameBDBM50053262
Synonyms:CHEMBL3322935
TypeSmall organic molecule
Emp. Form.C25H22N4O6
Mol. Mass.474.4654
SMILESCOC(=O)c1cccc(NC(=O)c2cc(ccc2O)-n2cc(nn2)-c2cc(OC)cc(OC)c2)c1