Reaction Details
TargetAurora kinase B
LigandBDBM50160880
Substrate/Competitorn/a
Meas. Tech.ChEMBL_1570319 (CHEMBL3795295)
IC50 20100±n/a nM
Citation Jeong, YLee, JRyu, JS Design, synthesis, and evaluation of hinge-binder tethered 1,2,3-triazolylsalicylamide derivatives as Aurora kinase inhibitors. Bioorg Med Chem24:2114-24 (2016) 
 
Aurora kinase B
Name:Aurora kinase B
Type:Protein
Mol. Mass.:39327.72
Organism:Homo sapiens (Human)
Description:Q96GD4
Residue:344
BDBM50160880
NameBDBM50160880
Synonyms:CHEMBL3794018
TypeSmall organic molecule
Emp. Form.C24H19N7O4S
Mol. Mass.501.517
SMILESCOC(=O)c1cccc(NC(=O)c2cc(ccc2O)-n2cc(CNc3ncnc4ccsc34)nn2)c1