Reaction Details
TargetAurora kinase B
LigandBDBM50160911
Substrate/Competitorn/a
Meas. Tech.ChEMBL_1570319 (CHEMBL3795295)
IC50 36500±n/a nM
Citation Jeong, YLee, JRyu, JS Design, synthesis, and evaluation of hinge-binder tethered 1,2,3-triazolylsalicylamide derivatives as Aurora kinase inhibitors. Bioorg Med Chem24:2114-24 (2016) 
 
Aurora kinase B
Name:Aurora kinase B
Type:Protein
Mol. Mass.:39327.72
Organism:Homo sapiens (Human)
Description:Q96GD4
Residue:344
BDBM50160911
NameBDBM50160911
Synonyms:CHEMBL3792563
TypeSmall organic molecule
Emp. Form.C24H21N5O4
Mol. Mass.443.4546
SMILESCOC(=O)c1cccc(NC(=O)c2cc(ccc2O)-n2cc(CNc3ccccc3)nn2)c1