Reaction Details
TargetAurora kinase B
LigandBDBM50160992
Substrate/Competitorn/a
Meas. Tech.ChEMBL_1570319 (CHEMBL3795295)
IC50 2190±n/a nM
Citation Jeong, YLee, JRyu, JS Design, synthesis, and evaluation of hinge-binder tethered 1,2,3-triazolylsalicylamide derivatives as Aurora kinase inhibitors. Bioorg Med Chem24:2114-24 (2016) 
 
Aurora kinase B
Name:Aurora kinase B
Type:Protein
Mol. Mass.:39327.72
Organism:Homo sapiens (Human)
Description:Q96GD4
Residue:344
BDBM50160992
NameBDBM50160992
Synonyms:CHEMBL3793405
TypeSmall organic molecule
Emp. Form.C24H18N4O6
Mol. Mass.458.4229
SMILESCOC(=O)c1cccc(NC(=O)c2cc(ccc2O)-n2cc(nn2)-c2ccc3OCOc3c2)c1