Reaction Details
TargetAurora kinase A
LigandBDBM50160887
Substrate/Competitorn/a
Meas. Tech.ChEMBL_1570318 (CHEMBL3795294)
IC50 7670±n/a nM
Citation Jeong, YLee, JRyu, JS Design, synthesis, and evaluation of hinge-binder tethered 1,2,3-triazolylsalicylamide derivatives as Aurora kinase inhibitors. Bioorg Med Chem24:2114-24 (2016) 
 
Aurora kinase A
Name:Aurora kinase A
Type:Serine/threonine-protein kinase
Mol. Mass.:45830.98
Organism:Homo sapiens (Human)
Description:O14965
Residue:403
BDBM50160887
NameBDBM50160887
Synonyms:CHEMBL3792988
TypeSmall organic molecule
Emp. Form.C23H21N7O4
Mol. Mass.459.4573
SMILESCOC(=O)c1cccc(NC(=O)c2cc(ccc2O)-n2cc(CCNc3ncccn3)nn2)c1