Reaction Details
TargetNuclear receptor ROR-gamma
LigandBDBM50161145
Substrate/Competitorn/a
Meas. Tech.ChEMBL_1571959 (CHEMBL3796417)
IC50 72±n/a nM
Citation Enyedy, IJPowell, NACaravella, Jvan Vloten, KChao, JBanerjee, DMarcotte, DSilvian, LMcKenzie, AHong, VSFontenot, JD Discovery of biaryls as ROR¿ inverse agonists by using structure-based design. Bioorg Med Chem Lett26:2459-63 (2016) 
 
Nuclear receptor ROR-gamma
Name:Nuclear receptor ROR-gamma
Type:Enzyme Catalytic Domain
Mol. Mass.:58218.40
Organism:Homo sapiens (Human)
Description:P51449
Residue:518
BDBM50161145
NameBDBM50161145
Synonyms:CHEMBL3793667
TypeSmall organic molecule
Emp. Form.C17H11ClF9NO3S
Mol. Mass.515.778
SMILESOC(c1ccc(cc1)N(CC(F)(F)F)S(=O)(=O)c1cccc(Cl)c1)(C(F)(F)F)C(F)(F)F