Reaction Details
TargetNuclear receptor ROR-gamma
LigandBDBM50161155
Substrate/Competitorn/a
Meas. Tech.ChEMBL_1571959 (CHEMBL3796417)
IC50 10.0±n/a nM
Citation Enyedy, IJPowell, NACaravella, Jvan Vloten, KChao, JBanerjee, DMarcotte, DSilvian, LMcKenzie, AHong, VSFontenot, JD Discovery of biaryls as ROR¿ inverse agonists by using structure-based design. Bioorg Med Chem Lett26:2459-63 (2016) 
 
Nuclear receptor ROR-gamma
Name:Nuclear receptor ROR-gamma
Type:Enzyme Catalytic Domain
Mol. Mass.:58218.40
Organism:Homo sapiens (Human)
Description:P51449
Residue:518
BDBM50161155
NameBDBM50161155
Synonyms:CHEMBL3793229
TypeSmall organic molecule
Emp. Form.C26H23ClF4N2O3S
Mol. Mass.554.984
SMILESCc1ccc(cc1C)S(=O)(=O)N(CC(F)(F)F)c1ccc2N(CCCc2c1)C(=O)c1c(F)cccc1Cl