Reaction Details
TargetRho-associated protein kinase 2
LigandBDBM50161159
Substrate/Competitorn/a
Meas. Tech.ChEMBL_1571974 (CHEMBL3796432)
IC50 10.0±n/a nM
Citation Shah, SSavjani, J A review on ROCK-II inhibitors: From molecular modelling to synthesis. Bioorg Med Chem Lett26:2383-91 (2016) 
 
Rho-associated protein kinase 2
Name:Rho-associated protein kinase 2
Type:Protein
Mol. Mass.:160885.43
Organism:Homo sapiens (Human)
Description:O75116
Residue:1388
BDBM50161159
NameBDBM50161159
Synonyms:CHEMBL3793353
TypeSmall organic molecule
Emp. Form.C16H22N4O
Mol. Mass.286.3721
SMILES[H][C@@]1(CC[C@@H](CC1)C(=O)Nc1ccnc2[nH]ccc12)[C@@H](C)N