Reaction Details
TargetMetallo-beta-lactamase type 2
LigandBDBM50129065
Substrate/Competitorn/a
Meas. Tech.ChEMBL_1567886 (CHEMBL3789281)
Ki 186000±n/a nM
Citation Christopeit, TLeiros, HK Fragment-based discovery of inhibitor scaffolds targeting the metallo-ß-lactamases NDM-1 and VIM-2. Bioorg Med Chem Lett26:1973-7 (2016) 
 
Metallo-beta-lactamase type 2
Name:Metallo-beta-lactamase type 2
Type:PROTEIN
Mol. Mass.:28498.15
Organism:Klebsiella pneumoniae
Description:ChEMBL_103887
Residue:270
BDBM50129065
NameBDBM50129065
Synonyms:CHEMBL3278535
TypeSmall organic molecule
Emp. Form.C10H5NO2
Mol. Mass.171.1522
SMILESO=c1c(coc2ccccc12)C#N