Reaction Details
TargetMu-type opioid receptor
LigandBDBM50161770
Substrate/Competitorn/a
Meas. Tech.ChEMBL_1567711 (CHEMBL3787926)
Ki 52±n/a nM
Citation Ishikawa, KMochizuki, YHirayama, SNemoto, TNagai, KItoh, KFujii, H Synthesis and evaluation of novel opioid ligands with a C-homomorphinan skeleton. Bioorg Med Chem24:2199-205 (2016) 
 
Mu-type opioid receptor
Name:Mu-type opioid receptor
Type:G Protein-Coupled Receptor (GPCR)
Mol. Mass.:44789.51
Organism:Homo sapiens (Human)
Description:P35372
Residue:400
BDBM50161770
NameBDBM50161770
Synonyms:CHEMBL3786083
TypeSmall organic molecule
Emp. Form.C28H31NO3
Mol. Mass.429.5506
SMILES[H][C@]12Cc3ccc(O)cc3[C@@]3(CCN1CC1CC1)CC(=O)\C(CC[C@@]23O)=C/c1ccccc1