Reaction Details
TargetKappa-type opioid receptor
LigandBDBM50161765
Substrate/Competitorn/a
Meas. Tech.ChEMBL_1567713 (CHEMBL3787928)
Ki 3.2±n/a nM
Citation Ishikawa, KMochizuki, YHirayama, SNemoto, TNagai, KItoh, KFujii, H Synthesis and evaluation of novel opioid ligands with a C-homomorphinan skeleton. Bioorg Med Chem24:2199-205 (2016) 
 
Kappa-type opioid receptor
Name:Kappa-type opioid receptor
Type:G Protein-Coupled Receptor (GPCR)
Mol. Mass.:42648.76
Organism:Homo sapiens (Human)
Description:P41145
Residue:380
BDBM50161765
NameBDBM50161765
Synonyms:CHEMBL3787263
TypeSmall organic molecule
Emp. Form.C27H28N2O2
Mol. Mass.412.5234
SMILES[H]C12Cc3ccc(O)cc3[C@@]3(CCN1CC1CC1)Cc1nc4ccccc4cc1C[C@@]23O