Reaction Details
TargetKappa-type opioid receptor
LigandBDBM50161768
Substrate/Competitorn/a
Meas. Tech.ChEMBL_1567713 (CHEMBL3787928)
Ki 9.1±n/a nM
Citation Ishikawa, KMochizuki, YHirayama, SNemoto, TNagai, KItoh, KFujii, H Synthesis and evaluation of novel opioid ligands with a C-homomorphinan skeleton. Bioorg Med Chem24:2199-205 (2016) 
 
Kappa-type opioid receptor
Name:Kappa-type opioid receptor
Type:G Protein-Coupled Receptor (GPCR)
Mol. Mass.:42648.76
Organism:Homo sapiens (Human)
Description:P41145
Residue:380
BDBM50161768
NameBDBM50161768
Synonyms:CHEMBL3786218
TypeSmall organic molecule
Emp. Form.C28H31NO3
Mol. Mass.429.5506
SMILES[H][C@]12Cc3ccc(O)cc3[C@@]3(CCN1CC1CC1)CC(=O)\C(CC[C@@]23O)=C\c1ccccc1