Reaction Details
TargetHistone deacetylase 7
LigandBDBM50161828
Substrate/Competitorn/a
Meas. Tech.ChEBML_1572335
IC50 10900±n/a nM
Citation Cincinelli, RZwick, VMusso, LZuco, VDe Cesare, MZunino, FSimoes-Pires, CNurisso, AGiannini, GCuendet, MDallavalle, S Biphenyl-4-yl-acrylohydroxamic acids: Identification of a novel indolyl-substituted HDAC inhibitor with antitumor activity. Eur J Med Chem112:99-105 (2016) 
 
Histone deacetylase 7
Name:Histone deacetylase 7
Type:Chromatin regulator; hydrolase; repressor
Mol. Mass.:102942.62
Organism:Homo sapiens (Human)
Description:Q8WUI4
Residue:952
BDBM50161828
NameBDBM50161828
Synonyms:CHEMBL3793310
TypeSmall organic molecule
Emp. Form.C26H22N2O2
Mol. Mass.394.4651
SMILESCc1[nH]c2ccccc2c1\C=C\c1ccccc1-c1ccc(\C=C\C(=O)NO)cc1