Reaction Details
TargetApoptosis regulator Bcl-2
LigandBDBM50162727
Substrate/Competitorn/a
Meas. Tech.ChEMBL_1570358 (CHEMBL3795377)
Ki 59±n/a nM
Citation Hennessy, EJ Selective inhibitors of Bcl-2 and Bcl-xL: Balancing antitumor activity with on-target toxicity. Bioorg Med Chem Lett26:2105-14 (2016) 
 
Apoptosis regulator Bcl-2
Name:Apoptosis regulator Bcl-2
Type:Homodimer or heterodimer
Mol. Mass.:26269.11
Organism:Homo sapiens (Human)
Description:P10415
Residue:239
BDBM50162727
NameBDBM50162727
Synonyms:CHEMBL3794524
TypeSmall organic molecule
Emp. Form.C34H38ClN5O7S
Mol. Mass.696.213
SMILES[O-][N+](=O)c1cc(ccc1NC1CCOCC1)S(=O)(=O)NC(=O)c1ccc(cc1)N1CCN(CC2=C(CCOC2)c2ccc(Cl)cc2)CC1