Reaction Details
TargetApoptosis regulator Bcl-2
LigandBDBM50162774
Substrate/Competitorn/a
Meas. Tech.ChEMBL_1570360 (CHEMBL3795379)
Ki<0.010000±n/a nM
Citation Hennessy, EJ Selective inhibitors of Bcl-2 and Bcl-xL: Balancing antitumor activity with on-target toxicity. Bioorg Med Chem Lett26:2105-14 (2016) 
 
Apoptosis regulator Bcl-2
Name:Apoptosis regulator Bcl-2
Type:Homodimer or heterodimer
Mol. Mass.:26269.11
Organism:Homo sapiens (Human)
Description:P10415
Residue:239
BDBM50162774
NameBDBM50162774
Synonyms:ABT-199 Venetoclax
TypeSmall organic molecule
Emp. Form.C45H50ClN7O7S
Mol. Mass.868.439
SMILESCC1(C)CCC(CN2CCN(CC2)c2ccc(C(=O)NS(=O)(=O)c3ccc(NCC4CCOCC4)c(c3)N(=O)=O)c(Oc3cnc4[nH]ccc4c3)c2)=C(C1)c1ccc(Cl)cc1