Reaction Details
TargetLysine-specific demethylase 5A
LigandBDBM50163387
Substrate/Competitorn/a
Meas. Tech.ChEMBL_1571723 (CHEMBL3795790)
IC50 4200±n/a nM
Citation Wu, XFang, ZYang, BZhong, LYang, QZhang, CHuang, SXiang, RSuzuki, TLi, LLYang, SY Discovery of KDM5A inhibitors: Homology modeling, virtual screening and structure-activity relationship analysis. Bioorg Med Chem Lett26:2284-8 (2016) 
 
Lysine-specific demethylase 5A
Name:Lysine-specific demethylase 5A
Type:Protein
Mol. Mass.:192091.79
Organism:Homo sapiens (Human)
Description:P29375
Residue:1690
BDBM50163387
NameBDBM50163387
Synonyms:CHEMBL3794377
TypeSmall organic molecule
Emp. Form.C24H18O6
Mol. Mass.402.3961
SMILESOc1cc(OCC(=O)OCc2ccccc2)cc2oc(cc(=O)c12)-c1ccccc1