Reaction Details
TargetLysine-specific demethylase 5A
LigandBDBM50320734
Substrate/Competitorn/a
Meas. Tech.ChEMBL_1571723 (CHEMBL3795790)
IC50 13000±n/a nM
Citation Wu, XFang, ZYang, BZhong, LYang, QZhang, CHuang, SXiang, RSuzuki, TLi, LLYang, SY Discovery of KDM5A inhibitors: Homology modeling, virtual screening and structure-activity relationship analysis. Bioorg Med Chem Lett26:2284-8 (2016) 
 
Lysine-specific demethylase 5A
Name:Lysine-specific demethylase 5A
Type:Protein
Mol. Mass.:192091.79
Organism:Homo sapiens (Human)
Description:P29375
Residue:1690
BDBM50320734
NameBDBM50320734
Synonyms:4-Hydroxy-benzoic acid hydrazide CHEMBL124267
TypeSmall organic molecule
Emp. Form.C7H8N2O2
Mol. Mass.152.1506
SMILESNNC(=O)c1ccc(O)cc1