Reaction Details
TargetLysine-specific demethylase 3A
LigandBDBM50163389
Substrate/Competitorn/a
Meas. Tech.ChEMBL_1571726 (CHEMBL3795793)
IC50 43000±n/a nM
Citation Wu, XFang, ZYang, BZhong, LYang, QZhang, CHuang, SXiang, RSuzuki, TLi, LLYang, SY Discovery of KDM5A inhibitors: Homology modeling, virtual screening and structure-activity relationship analysis. Bioorg Med Chem Lett26:2284-8 (2016) 
 
Lysine-specific demethylase 3A
Name:Lysine-specific demethylase 3A
Type:PROTEIN
Mol. Mass.:147368.22
Organism:Homo sapiens (Human)
Description:Q9Y4C1
Residue:1321
BDBM50163389
NameBDBM50163389
Synonyms:CHEMBL3793278
TypeSmall organic molecule
Emp. Form.C5H6N4O2
Mol. Mass.154.1267
SMILESNNc1nccc(n1)C(O)=O