Reaction Details
TargetCarbonic anhydrase 7
LigandBDBM50329822
Substrate/Competitorn/a
Meas. Tech.ChEMBL_1572870 (CHEMBL3801006)
Kd 310±n/a nM
Citation Talibov, VOLinkuviene, VMatulis, DDanielson, UH Kinetically Selective Inhibitors of Human Carbonic Anhydrase Isozymes I, II, VII, IX, XII, and XIII. J Med Chem59:2083-93 (2016) 
 
Carbonic anhydrase 7
Name:Carbonic anhydrase 7
Type:Enzyme
Mol. Mass.:29664.11
Organism:Homo sapiens (Human)
Description:Human cloned isozyme.
Residue:264
BDBM50329822
NameBDBM50329822
Synonyms:5-[(2-Benzyl-1H-benzimidazol-1-yl)acetyl]-2-chlorobenzenesulfonamide N-alkylated benzimidazole derivative, 4d | carbonic anhydrase (CA) inhibitors, benzenesulphonamide ligand, 5
TypeSmall organic molecule
Emp. Form.C22H18ClN3O3S
Mol. Mass.439.915
SMILESNS(=O)(=O)c1cc(ccc1Cl)C(=O)Cn1c(Cc2ccccc2)nc2ccccc12