Reaction Details
TargetCarbonic anhydrase 12
LigandBDBM50163865
Substrate/Competitorn/a
Meas. Tech.ChEMBL_1572878 (CHEMBL3801014)
Kd 95±n/a nM
Citation Talibov, VOLinkuviene, VMatulis, DDanielson, UH Kinetically Selective Inhibitors of Human Carbonic Anhydrase Isozymes I, II, VII, IX, XII, and XIII. J Med Chem59:2083-93 (2016) 
 
Carbonic anhydrase 12
Name:Carbonic anhydrase 12
Type:Enzyme
Mol. Mass.:39456.00
Organism:Homo sapiens (Human)
Description:Catalytic domain of human cloned isozyme was used in the assay
Residue:354
BDBM50163865
NameBDBM50163865
Synonyms:CHEMBL3799577 | carbonic anhydrase (CA) inhibitors, benzenesulphonamide ligand, 14
TypeSmall organic molecule
Emp. Form.C15H15F3N2O4S2
Mol. Mass.408.416
SMILESCNc1c(F)c(c(F)c(F)c1S(=O)(=O)CCc1ccccc1)S(N)(=O)=O