Reaction Details
TargetCarbonic anhydrase 7
LigandBDBM50163865
Substrate/Competitorn/a
Meas. Tech.ChEMBL_1572870 (CHEMBL3801006)
Kd 45±n/a nM
Citation Talibov, VOLinkuviene, VMatulis, DDanielson, UH Kinetically Selective Inhibitors of Human Carbonic Anhydrase Isozymes I, II, VII, IX, XII, and XIII. J Med Chem59:2083-93 (2016) 
 
Carbonic anhydrase 7
Name:Carbonic anhydrase 7
Type:Enzyme
Mol. Mass.:29664.11
Organism:Homo sapiens (Human)
Description:Human cloned isozyme.
Residue:264
BDBM50163865
NameBDBM50163865
Synonyms:CHEMBL3799577 | carbonic anhydrase (CA) inhibitors, benzenesulphonamide ligand, 14
TypeSmall organic molecule
Emp. Form.C15H15F3N2O4S2
Mol. Mass.408.416
SMILESCNc1c(F)c(c(F)c(F)c1S(=O)(=O)CCc1ccccc1)S(N)(=O)=O