Reaction Details
TargetCarbonic anhydrase 7
LigandBDBM50163860
Substrate/Competitorn/a
Meas. Tech.ChEMBL_1572870 (CHEMBL3801006)
Kd 27±n/a nM
Citation Talibov, VOLinkuviene, VMatulis, DDanielson, UH Kinetically Selective Inhibitors of Human Carbonic Anhydrase Isozymes I, II, VII, IX, XII, and XIII. J Med Chem59:2083-93 (2016) 
 
Carbonic anhydrase 7
Name:Carbonic anhydrase 7
Type:Enzyme
Mol. Mass.:29664.11
Organism:Homo sapiens (Human)
Description:Human cloned isozyme.
Residue:264
BDBM50163860
NameBDBM50163860
Synonyms:CHEMBL3797893 | carbonic anhydrase (CA) inhibitors, benzenesulphonamide ligand, 16
TypeSmall organic molecule
Emp. Form.C11H12F4N2O2S
Mol. Mass.312.284
SMILESNS(=O)(=O)c1c(F)c(F)c(N2CCCCC2)c(F)c1F