Reaction Details
TargetCarbonic anhydrase 7
LigandBDBM50163862
Substrate/Competitorn/a
Meas. Tech.ChEMBL_1572871 (CHEMBL3801007)
Kd 8.3±n/a nM
Citation Talibov, VOLinkuviene, VMatulis, DDanielson, UH Kinetically Selective Inhibitors of Human Carbonic Anhydrase Isozymes I, II, VII, IX, XII, and XIII. J Med Chem59:2083-93 (2016) 
 
Carbonic anhydrase 7
Name:Carbonic anhydrase 7
Type:Enzyme
Mol. Mass.:29664.11
Organism:Homo sapiens (Human)
Description:Human cloned isozyme.
Residue:264
BDBM50163862
NameBDBM50163862
Synonyms:4-(1H-benzimidazol-1-ylacetyl)benzenesulfonamide (1a) carbonic anhydrase (CA) inhibitors, benzenesulphonamide ligand, 1
TypeSmall organic molecule
Emp. Form.C15H13N3O3S
Mol. Mass.315.347
SMILESNS(=O)(=O)c1ccc(cc1)C(=O)Cn1cnc2ccccc12