Reaction Details
TargetCarbonic anhydrase 13
LigandBDBM50163860
Substrate/Competitorn/a
Meas. Tech.ChEMBL_1572883 (CHEMBL3801019)
Kd 4.0±n/a nM
Citation Talibov, VOLinkuviene, VMatulis, DDanielson, UH Kinetically Selective Inhibitors of Human Carbonic Anhydrase Isozymes I, II, VII, IX, XII, and XIII. J Med Chem59:2083-93 (2016) 
 
Carbonic anhydrase 13
Name:Carbonic anhydrase 13
Type:Enzyme
Mol. Mass.:29445.78
Organism:Homo sapiens (Human)
Description:Q8N1Q1
Residue:262
BDBM50163860
NameBDBM50163860
Synonyms:CHEMBL3797893 | carbonic anhydrase (CA) inhibitors, benzenesulphonamide ligand, 16
TypeSmall organic molecule
Emp. Form.C11H12F4N2O2S
Mol. Mass.312.284
SMILESNS(=O)(=O)c1c(F)c(F)c(N2CCCCC2)c(F)c1F