Reaction Details
TargetCarbonic anhydrase 12
LigandBDBM50429922
Substrate/Competitorn/a
Meas. Tech.ChEMBL_1572879 (CHEMBL3801015)
Kd 14±n/a nM
Citation Talibov, VOLinkuviene, VMatulis, DDanielson, UH Kinetically Selective Inhibitors of Human Carbonic Anhydrase Isozymes I, II, VII, IX, XII, and XIII. J Med Chem59:2083-93 (2016) 
 
Carbonic anhydrase 12
Name:Carbonic anhydrase 12
Type:Enzyme
Mol. Mass.:39456.00
Organism:Homo sapiens (Human)
Description:Catalytic domain of human cloned isozyme was used in the assay
Residue:354
BDBM50429922
NameBDBM50429922
Synonyms:CHEMBL2333418 | carbonic anhydrase (CA) inhibitors, benzenesulphonamide ligand, 11
TypeSmall organic molecule
Emp. Form.C9H9F4NO2S2
Mol. Mass.303.297
SMILESCCCSc1c(F)c(F)c(c(F)c1F)S(N)(=O)=O