Reaction Details
TargetCarbonic anhydrase 1
LigandBDBM50163867
Substrate/Competitorn/a
Meas. Tech.ChEMBL_1572863 (CHEMBL3800999)
Kd 330±n/a nM
Citation Talibov, VOLinkuviene, VMatulis, DDanielson, UH Kinetically Selective Inhibitors of Human Carbonic Anhydrase Isozymes I, II, VII, IX, XII, and XIII. J Med Chem59:2083-93 (2016) 
 
Carbonic anhydrase 1
Name:Carbonic anhydrase 1
Type:Enzyme
Mol. Mass.:28873.37
Organism:Homo sapiens (Human)
Description:P00915
Residue:261
BDBM50163867
NameBDBM50163867
Synonyms:CHEMBL2443189 | carbonic anhydrase (CA) inhibitors, benzenesulphonamide ligand, 9
TypeSmall organic molecule
Emp. Form.C12H11N3O3S2
Mol. Mass.309.364
SMILESNS(=O)(=O)c1cccc(c1)C(=O)CSc1ncccn1