Reaction Details
TargetCarbonic anhydrase 1
LigandBDBM50163860
Substrate/Competitorn/a
Meas. Tech.ChEMBL_1572863 (CHEMBL3800999)
Kd 0.029±n/a nM
Citation Talibov, VOLinkuviene, VMatulis, DDanielson, UH Kinetically Selective Inhibitors of Human Carbonic Anhydrase Isozymes I, II, VII, IX, XII, and XIII. J Med Chem59:2083-93 (2016) 
 
Carbonic anhydrase 1
Name:Carbonic anhydrase 1
Type:Enzyme
Mol. Mass.:28873.37
Organism:Homo sapiens (Human)
Description:P00915
Residue:261
BDBM50163860
NameBDBM50163860
Synonyms:CHEMBL3797893 | carbonic anhydrase (CA) inhibitors, benzenesulphonamide ligand, 16
TypeSmall organic molecule
Emp. Form.C11H12F4N2O2S
Mol. Mass.312.284
SMILESNS(=O)(=O)c1c(F)c(F)c(N2CCCCC2)c(F)c1F