Reaction Details
TargetCarbonic anhydrase 2
LigandBDBM50163867
Substrate/Competitorn/a
Meas. Tech.ChEMBL_1572866 (CHEMBL3801002)
Kd 520±n/a nM
Citation Talibov, VOLinkuviene, VMatulis, DDanielson, UH Kinetically Selective Inhibitors of Human Carbonic Anhydrase Isozymes I, II, VII, IX, XII, and XIII. J Med Chem59:2083-93 (2016) 
 
Carbonic anhydrase 2
Name:Carbonic anhydrase 2
Type:Enzyme
Mol. Mass.:29250.71
Organism:Homo sapiens (Human)
Description:P00918
Residue:260
BDBM50163867
NameBDBM50163867
Synonyms:CHEMBL2443189 | carbonic anhydrase (CA) inhibitors, benzenesulphonamide ligand, 9
TypeSmall organic molecule
Emp. Form.C12H11N3O3S2
Mol. Mass.309.364
SMILESNS(=O)(=O)c1cccc(c1)C(=O)CSc1ncccn1