Reaction Details
TargetCarbonic anhydrase 2
LigandBDBM50163858
Substrate/Competitorn/a
Meas. Tech.ChEMBL_1572867 (CHEMBL3801003)
Kd 3.3±n/a nM
Citation Talibov, VOLinkuviene, VMatulis, DDanielson, UH Kinetically Selective Inhibitors of Human Carbonic Anhydrase Isozymes I, II, VII, IX, XII, and XIII. J Med Chem59:2083-93 (2016) 
 
Carbonic anhydrase 2
Name:Carbonic anhydrase 2
Type:Enzyme
Mol. Mass.:29250.71
Organism:Homo sapiens (Human)
Description:P00918
Residue:260
BDBM50163858
NameBDBM50163858
Synonyms:CHEMBL2443188 | carbonic anhydrase (CA) inhibitors, benzenesulphonamide ligand, 7
TypeSmall organic molecule
Emp. Form.C12H10ClN3O3S2
Mol. Mass.343.809
SMILESNS(=O)(=O)c1ccc(cc1Cl)C(=O)CSc1ncccn1