Reaction Details
TargetCarbonic anhydrase 2
LigandBDBM50380140
Substrate/Competitorn/a
Meas. Tech.ChEMBL_1572867 (CHEMBL3801003)
Kd 140±n/a nM
Citation Talibov, VOLinkuviene, VMatulis, DDanielson, UH Kinetically Selective Inhibitors of Human Carbonic Anhydrase Isozymes I, II, VII, IX, XII, and XIII. J Med Chem59:2083-93 (2016) 
 
Carbonic anhydrase 2
Name:Carbonic anhydrase 2
Type:Enzyme
Mol. Mass.:29250.71
Organism:Homo sapiens (Human)
Description:P00918
Residue:260
BDBM50380140
NameBDBM50380140
Synonyms:CHEMBL2011155 | carbonic anhydrase (CA) inhibitors, benzenesulphonamide ligand, 10
TypeSmall organic molecule
Emp. Form.C12H10ClN3O3S2
Mol. Mass.343.809
SMILESNS(=O)(=O)c1cc(ccc1Cl)C(=O)CSc1ncccn1