Reaction Details
TargetCarbonic anhydrase 9
LigandBDBM50163866
Substrate/Competitorn/a
Meas. Tech.ChEMBL_1572875 (CHEMBL3801011)
Kd 0.20±n/a nM
Citation Talibov, VOLinkuviene, VMatulis, DDanielson, UH Kinetically Selective Inhibitors of Human Carbonic Anhydrase Isozymes I, II, VII, IX, XII, and XIII. J Med Chem59:2083-93 (2016) 
 
Carbonic anhydrase 9
Name:Carbonic anhydrase 9
Type:Enzyme
Mol. Mass.:49669.03
Organism:Homo sapiens (Human)
Description:Catalytic domain of human cloned isozyme was used in the assay
Residue:459
BDBM50163866
NameBDBM50163866
Synonyms:CHEMBL3798473 | carbonic anhydrase (CA) inhibitors, benzenesulphonamide ligand, 15
TypeSmall organic molecule
Emp. Form.C18H21F3N2O4S2
Mol. Mass.450.496
SMILESCC(C)(C)Nc1c(F)c(c(F)c(F)c1S(=O)(=O)CCc1ccccc1)S(N)(=O)=O